[erlang-questions] Can't compile tests

Travis Jensen travis.jensen@REDACTED
Thu Apr 28 23:11:47 CEST 2011

I'm getting this error when trying to compile tests:

make  RELEASE_PATH=/Users/travis/src2/foss/erlang-otp/release/tests
erlc -W  +debug_info -o./ et_wx_SUITE.erl
./et_test_lib.hrl:19: can't find include lib "wx/include/wx.hrl"
make[2]: *** [et_wx_SUITE.beam] Error 1
make[1]: *** [release_tests] Error 2
make: *** [lib/et/test] Error 2

I've tried both "otp_build tests" and "make release_tests" (from $ERL_TOP).
 I'm wondering if I'm missing an environment variable or something.


*Travis Jensen*
*Read the Software Maven @ http://softwaremaven.innerbrane.com/
Read my LinkedIn profile @ http://www.linkedin.com/in/travisjensen
Read my Twitter mumblings @ http://twitter.com/SoftwareMaven
Send me email @ travis.jensen@REDACTED

**What kind of guy calls himself the Software Maven???**
-------------- next part --------------
An HTML attachment was scrubbed...
URL: <http://erlang.org/pipermail/erlang-questions/attachments/20110428/b5e35740/attachment.htm>

More information about the erlang-questions mailing list