R14B compile failure on Ubuntu 9.04

Andrew M <>
Tue Oct 26 19:41:08 CEST 2010


			Hi there,I have been trying to compile R14B, ending in the following failure:=== Entering application hipemake[3]: Entering directory `/usr/src/otp_src_R14B/lib/hipe/misc'erlc -W  +debug_info +warn_exported_vars +warn_missing_spec +warn_untyped_record -o../ebin hipe_consttab.erlpthread/ethr_event.c:92: Fatal error in wait__(): Function not implemented (38)make[3]: *** [../ebin/hipe_consttab.beam] Abortedmake[3]: Leaving directory `/usr/src/otp_src_R14B/lib/hipe/misc'make[2]: *** [opt] Error 2make[2]: Leaving directory `/usr/src/otp_src_R14B/lib/hipe'make[1]: *** [opt] Error 2make[1]: Leaving directory `/usr/src/otp_src_R14B/lib'make: *** [secondary_bootstrap_build] Error 2Line 92 calls ETHR_FATAL_ERROR__()Am I missing a library, if so, which one?Thanks for your help,Andrew
			
		
        


More information about the erlang-questions mailing list