[erlang-questions] Fwd: Build Error (Job 324): erlang-R12B-3_3_el4 on fedora-4-epel

Peter Lemenkov <>
Sat Sep 27 22:23:24 CEST 2008


Hello All!
I encountered strange build error while trying to rebuild erlang on
Red Hat Enterprise Linux 4.x for PowerPC arch:

==========================================

---------- Forwarded message ----------
From:  <>
Date: 28.09.2008 0:16
Subject: Build Error (Job 324): erlang-R12B-3_3_el4 on fedora-4-epel
To: 


Job failed on arch ppc


         Build logs may be found at
http://buildsys.fedoraproject.org/logs/fedora-4-epel/324-erlang-R12B-3.3.el4/


 -------------------------------------------------

 Makefile:35: warning: overriding commands for target `docs'
 /builddir/build/BUILD/otp_src_R12B-3/make/otp_subdir.mk:28: warning:
ignoring old commands for target `docs'
 === Entering application hipe
 make[3]: Entering directory `/builddir/build/BUILD/otp_src_R12B-3/lib/hipe/rtl'
 /builddir/build/BUILD/otp_src_R12B-3/bin/powerpc-unknown-linux-gnu/hipe_mkliterals
-e > hipe_literals.hrl
 erlc -W  +debug_info +warn_obsolete_guard +inline -o../ebin hipe_rtl_arch.erl
 Failed to create thread:
 make[3]: Leaving directory `/builddir/build/BUILD/otp_src_R12B-3/lib/hipe/rtl'
 make[2]: Leaving directory `/builddir/build/BUILD/otp_src_R12B-3/lib/hipe'
 make[1]: Leaving directory `/builddir/build/BUILD/otp_src_R12B-3/lib'
 RPM build errors:
  Invalid argument (22)
 make[3]: *** [../ebin/hipe_rtl_arch.beam] Aborted
 make[2]: *** [opt] Error 2
 make[1]: *** [opt] Error 2
 make: *** [secondary_bootstrap_build] Error 2
 error: Bad exit status from /var/tmp/rpm-tmp.1781 (%build)
    Bad exit status from /var/tmp/rpm-tmp.1781 (%build)
 Child returncode was: 1
 EXCEPTION: Command failed. See logs for output.
  # ['bash', '--login', '-c', 'rpmbuild -bb --target ppc --nodeps
builddir/build/SPECS/erlang.spec']
 Traceback (most recent call last):
  File "/usr/lib/python2.4/site-packages/mock/trace_decorator.py",
line 70, in trace
    result = func(*args, **kw)
  File "/usr/lib/python2.4/site-packages/mock/util.py", line 316, in do
    raise mock.exception.Error, ("Command failed. See logs for
output.\n # %s" % (command,), child.returncode)
 Error: Command failed. See logs for output.
  # ['bash', '--login', '-c', 'rpmbuild -bb --target ppc --nodeps
builddir/build/SPECS/erlang.spec']
 LEAVE do --> EXCEPTION RAISED

==========================================

Right now I have no clue what to do with it. Does someone have an idea?

-- 
With best regards!



More information about the erlang-questions mailing list