[erlang-questions] problems building r11b-3

Ulf Wiger <>
Wed Dec 10 14:31:07 CET 2008


Does anyone know why r11b-3 and r11b-5 fail to build on
a fresh Ubuntu 8.10, whereas r12b-5 builds just fine?

BR,
Ulf W

obj/i686-pc-linux-gnu/opt/hybrid/hipe_x86_bifs.o: In function
`nbif_handle_fp_exception':
/home/uwiger/src/otp/otp_src_R11B-3/erts/emulator/i686-pc-linux-gnu/opt/hybrid/hipe_x86_bifs.S:269:
undefined reference to `erts_restore_fpu'
obj/i686-pc-linux-gnu/opt/hybrid/hipe_x86_signal.o: In function `my_sigaction':
/home/uwiger/src/otp/otp_src_R11B-3/erts/emulator/hipe/hipe_x86_signal.c:220:
undefined reference to `INIT'
/home/uwiger/src/otp/otp_src_R11B-3/erts/emulator/hipe/hipe_x86_signal.c:230:
undefined reference to `__next_sigaction'
obj/i686-pc-linux-gnu/opt/hybrid/hipe_x86_signal.o: In function
`hipe_signal_init':
/home/uwiger/src/otp/otp_src_R11B-3/erts/emulator/hipe/hipe_x86_signal.c:305:
undefined reference to `INIT'
obj/i686-pc-linux-gnu/opt/hybrid/hipe_x86_signal.o: In function `my_sigaction':
/home/uwiger/src/otp/otp_src_R11B-3/erts/emulator/hipe/hipe_x86_signal.c:220:
undefined reference to `INIT'
/home/uwiger/src/otp/otp_src_R11B-3/erts/emulator/hipe/hipe_x86_signal.c:230:
undefined reference to `__next_sigaction'
/home/uwiger/src/otp/otp_src_R11B-3/erts/emulator/hipe/hipe_x86_signal.c:220:
undefined reference to `INIT'
/home/uwiger/src/otp/otp_src_R11B-3/erts/emulator/hipe/hipe_x86_signal.c:230:
undefined reference to `__next_sigaction'
collect2: ld returned 1 exit status
make[3]: *** [/home/uwiger/src/otp/otp_src_R11B-3/bin/i686-pc-linux-gnu/beam.hybrid]
Error 1
make[3]: Leaving directory `/home/uwiger/src/otp/otp_src_R11B-3/erts/emulator'
make[2]: *** [opt] Error 2
make[2]: Leaving directory `/home/uwiger/src/otp/otp_src_R11B-3/erts/emulator'
make[1]: *** [hybrid] Error 2
make[1]: Leaving directory `/home/uwiger/src/otp/otp_src_R11B-3/erts'
make: *** [emulator] Error 2



More information about the erlang-questions mailing list