jungerl error while building ssh

Joel Reymont <>
Wed Aug 30 13:25:16 CEST 2006


I'm on Mac OSX. Has anyone seen this?

	Thanks, Joel

--
gcc -g -O2 -DHAVE_CONFIG_H -I/usr/local/lib/erlang/usr/include - 
I../../../support   -c -o loop_drv.o loop_drv.c
loop_drv.c: In function 'free_buffer':
loop_drv.c:742: error: 'struct erl_drv_binary' has no member named  
'refc'
loop_drv.c: In function 'http_hash_lookup':
loop_drv.c:1181: warning: pointer targets in passing argument 2 of  
'strncmp' differ in signedness
loop_drv.c: In function 'http_init':
loop_drv.c:1199: warning: pointer targets in assignment differ in  
signedness
loop_drv.c: In function 'http_message':
loop_drv.c:1615: warning: pointer targets in passing argument 1 of  
'http_hash_lookup' differ in signedness
loop_drv.c:1758: warning: pointer targets in passing argument 1 of  
'http_hash_lookup' differ in signedness
loop_drv.c: In function 'inet_fill_stat':
loop_drv.c:2720: warning: incompatible implicit declaration of built- 
in function 'fabs'
make[3]: *** [loop_drv.o] Error 1
make[2]: *** [all] Error 1
make[1]: *** [ssh] Error 2
make: *** [all] Error 2
junior:~/work/erlang/jungerl joelr$ find . -name loop_drv.c
./lib/ssh/c_src/loop_drv.c

--
http://wagerlabs.com/








More information about the erlang-questions mailing list