Can't compile erlang-11.2.0

Conrad Kostecki <>
Mon Aug 28 12:27:11 CEST 2006


Hello!
I am using Gentoo Linux 2006.0.

But I just can't compile erlang 11.2.0.

I get this Error:

hybrid.beam/i586-pc-linux-gnu/hipe_bif2.o /var/tmp/portage/erlang-11.2.0/work/otp_src_R11B-0/erts/obj.hybrid.beam/i586-pc-linux-gnu/hipe_debug.o /var/tmp/portage/erlang-11.2.0/work/otp_src_R11B-0/erts/obj.hybrid.beam/i586-pc-linux-gnu/hipe_gc.o /var/tmp/portage/erlang-11.2.0/work/otp_src_R11B-0/erts/obj.hybrid.beam/i586-pc-linux-gnu/hipe_mode_switch.o /var/tmp/portage/erlang-11.2.0/work/otp_src_R11B-0/erts/obj.hybrid.beam/i586-pc-linux-gnu/hipe_native_bif.o /var/tmp/portage/erlang-11.2.0/work/otp_src_R11B-0/erts/obj.hybrid.beam/i586-pc-linux-gnu/hipe_stack.o /var/tmp/portage/erlang-11.2.0/work/otp_src_R11B-0/erts/obj.hybrid.beam/i586-pc-linux-gnu/hipe_x86.o /var/tmp/portage/erlang-11.2.0/work/otp_src_R11B-0/erts/obj.hybrid.beam/i586-pc-linux-gnu/hipe_x86_glue.o /var/tmp/portage/erlang-11.2.0/work/otp_src_R11B-0/erts/obj.hybrid.beam/i586-pc-linux-gnu/hipe_x86_bifs.o /var/tmp/portage/erlang-11.2.0/work/otp_src_R11B-0/erts/obj.hybrid.beam/i586-pc-linux-gnu/hipe_x86_signal.o /var/tmp/portage/erlang-11.2.0/work/otp_src_R11B-0/erts/obj.hybrid.beam/i586-pc-linux-gnu/hipe_x86_stack.o /var/tmp/portage/erlang-11.2.0/work/otp_src_R11B-0/erts/obj.hybrid.beam/i586-pc-linux-gnu/efile_drv.o /var/tmp/portage/erlang-11.2.0/work/otp_src_R11B-0/erts/obj.hybrid.beam/i586-pc-linux-gnu/ddll_drv.o /var/tmp/portage/erlang-11.2.0/work/otp_src_R11B-0/erts/obj.hybrid.beam/i586-pc-linux-gnu/inet_drv.o /var/tmp/portage/erlang-11.2.0/work/otp_src_R11B-0/erts/obj.hybrid.beam/i586-pc-linux-gnu/zlib_drv.o /var/tmp/portage/erlang-11.2.0/work/otp_src_R11B-0/erts/obj.hybrid.beam/i586-pc-linux-gnu/ram_file_drv.o /var/tmp/portage/erlang-11.2.0/work/otp_src_R11B-0/erts/obj.hybrid.beam/i586-pc-linux-gnu/ttsl_drv.o -ldl -lm   -lncurses -L../lib/internal/i586-pc-linux-gnu /var/tmp/portage/erlang-11.2.0/work/otp_src_R11B-0/erts/obj/i586-pc-linux-gnu/libz.a -lethread -lpthread -lerts_internal_r
/var/tmp/portage/erlang-11.2.0/work/otp_src_R11B-0/erts/obj.hybrid.beam/i586-pc-linux-gnu/hipe_x86_bifs.o: In function `nbif_handle_fp_exception':
i586-pc-linux-gnu/hybrid/hipe_x86_bifs.S:(.text+0x7): undefined reference to `erts_restore_fpu'
collect2: ld gab 1 als Ende-Status zurück
make[3]: *** [/var/tmp/portage/erlang-11.2.0/work/otp_src_R11B-0/bin/i586-pc-linux-gnu/beam.hybrid] Fehler 1
make[3]: Leaving directory `/var/tmp/portage/erlang-11.2.0/work/otp_src_R11B-0/erts/emulator'
make[2]: *** [hybrid] Fehler 2
make[2]: Leaving directory `/var/tmp/portage/erlang-11.2.0/work/otp_src_R11B-0/erts/emulator'
make[1]: *** [hybrid] Fehler 2
make[1]: Leaving directory `/var/tmp/portage/erlang-11.2.0/work/otp_src_R11B-0/erts'
make: *** [emulator] Fehler 2

!!! ERROR: dev-lang/erlang-11.2.0 failed.
Call stack:
  ebuild.sh, line 1543:   Called dyn_compile
  ebuild.sh, line 938:   Called src_compile
  erlang-11.2.0.ebuild, line 53:   Called die

!!! (no error message)
!!! If you need support, post the topmost build error, and the call stack if relevant.

Conrad
-------------- next part --------------
An HTML attachment was scrubbed...
URL: <http://erlang.org/pipermail/erlang-questions/attachments/20060828/4b854ea1/attachment.html>


More information about the erlang-questions mailing list