The update R7B-4 is released (MacOsX.1 compile problem)

Håkan Stenholm <>
Wed Oct 17 23:56:49 CEST 2001


Has anyone solved this ? I get the same error running MacOsX.1 and 
R7B-3, so I guess this is a MacOsX.1 bug not R7B-3 or 4. Is it fixed in 
R8B-0 (I haven't had time to test it yet)?:

------------------------------------------------------------------------------------------------------------

cc -g -O2 
-I/Users/hokan/codeing/otp_src_R7B-3/erts/autoconf/powerpc-apple-
darwin1.4  -no-cpp-precomp  -Wall -O2 -DDEBUG_DIST -I. 
-DHAVE_CONFIG_H    -DUSE_DNS -DEPMD_PORT=4369 -c erl_error.c -o 
/Users/hokan/codeing/otp_src_R7B-3/lib/erl_interface/obj/powerpc-apple-darwin1.
4/erl_error.o
cc -g -O2 
-I/Users/hokan/codeing/otp_src_R7B-3/erts/autoconf/powerpc-apple-
darwin1.4  -no-cpp-precomp  -Wall -O2 -DDEBUG_DIST -I. 
-DHAVE_CONFIG_H    -DUSE_DNS -DEPMD_PORT=4369 -c erl_eterm.c -o 
/Users/hokan/codeing/otp_src_R7B-3/lib/erl_interface/obj/powerpc-apple-darwin1.
4/erl_eterm.o
cc -g -O2 
-I/Users/hokan/codeing/otp_src_R7B-3/erts/autoconf/powerpc-apple-
darwin1.4  -no-cpp-precomp  -Wall -O2 -DDEBUG_DIST -I. 
-DHAVE_CONFIG_H    -DUSE_DNS -DEPMD_PORT=4369 -c erl_fix_alloc.c -o 
/Users/hokan/codeing/otp_src_R7B-3/lib/erl_interface/obj/powerpc-apple-darwin1.
4/erl_fix_alloc.o
cc -g -O2 
-I/Users/hokan/codeing/otp_src_R7B-3/erts/autoconf/powerpc-apple-
darwin1.4  -no-cpp-precomp  -Wall -O2 -DDEBUG_DIST -I. 
-DHAVE_CONFIG_H    -DUSE_DNS -DEPMD_PORT=4369 -c erl_format.c -o 
/Users/hokan/codeing/otp_src_R7B-3/lib/erl_interface/obj/powerpc-apple-darwin1.
4/erl_format.o
cc -g -O2 
-I/Users/hokan/codeing/otp_src_R7B-3/erts/autoconf/powerpc-apple-
darwin1.4  -no-cpp-precomp  -Wall -O2 -DDEBUG_DIST -I. 
-DHAVE_CONFIG_H    -DUSE_DNS -DEPMD_PORT=4369 -c erl_locking.c -o 
/Users/hokan/codeing/otp_src_R7B-3/lib/erl_interface/obj/powerpc-apple-darwin1.
4/erl_locking.o
cc -g -O2 
-I/Users/hokan/codeing/otp_src_R7B-3/erts/autoconf/powerpc-apple-
darwin1.4  -no-cpp-precomp  -Wall -O2 -DDEBUG_DIST -I. 
-DHAVE_CONFIG_H    -DUSE_DNS -DEPMD_PORT=4369 -c erl_malloc.c -o 
/Users/hokan/codeing/otp_src_R7B-3/lib/erl_interface/obj/powerpc-apple-darwin1.
4/erl_malloc.o
/var/tmp/ccuCdaaa.s:324:Expected comma after segment-name
/var/tmp/ccuCdaaa.s:324:Rest of line ignored. 1st junk character valued 
46 (.).
/var/tmp/ccuCdaaa.s:324:Spurious digit 0.
/var/tmp/ccuCdaaa.s:324:Spurious digit 6.
/var/tmp/ccuCdaaa.s:324:Rest of line ignored. 1st junk character valued 
57 (9).
/var/tmp/ccuCdaaa.s:324:Junk character 40 (().
/var/tmp/ccuCdaaa.s:324:Rest of line ignored. 1st junk character valued 
48 (0).
make[4]: *** 
[/Users/hokan/codeing/otp_src_R7B-3/lib/erl_interface/obj/powerpc-apple-darwin1.
4/erl_malloc.o] Error 1
make[3]: *** [opt] Error 2
make[2]: *** [opt] Error 2
make[1]: *** [opt] Error 2
make: *** [libs] Error 2




More information about the erlang-questions mailing list