[erlang-bugs] Erlang on PowerPC 64 RHEL 4

philippe vanderstraeten <>
Sat Aug 9 13:06:47 CEST 2008


I also upload configure, configure.in, and config.status

On Sat, Aug 9, 2008 at 11:57 AM, philippe vanderstraeten <
> wrote:

> Hi,
>
> thanks for your answer. I have uploaded make and configure stdout and
> stderr. URLs are:
> http://pagesperso-orange.fr/punu/erlang/configure.log
> http://pagesperso-orange.fr/punu/erlang/make.log
>
> Thanks for your help.
>
>
> On Fri, Aug 8, 2008 at 11:10 PM, Mikael Pettersson <> wrote:
>
>> philippe vanderstraeten writes:
>>  > Hello ,
>>  >
>>  > I wanted to know if Erlang otp_src_R12B-2 is supported on PowerPC 64
>> and
>>  > RHEL 4 (Red Hat Enterprise Linux AS release 4 (Nahant Update 3)).
>>  >
>>  > I started the install script and I got errors at the end:
>>  >
>>  >
>>  >
>> /home/admin/download/otp_src_R12B-2/erts/start_scripts/start_all_example.rel.src
>>  > >
>>  >
>> /home/admin/download/otp_src_R12B-2/erts/start_scripts/start_all_example.rel
>>  > /usr/bin/install -c -d
>>  > /home/admin/download/otp_src_R12B-2/erts/start_scripts/tmp
>>  > ( cd /home/admin/download/otp_src_R12B-2/erts/start_scripts/tmp && \
>>  > erlc -W   -I/home/admin/download/otp_src_R12B-2/lib/kernel/ebin
>>  > -I/home/admin/download/otp_src_R12B-2/lib/stdlib/ebin
>>  > -I/home/admin/download/otp_src_R12B-2/lib/sasl/ebin -o
>>  >
>> /home/admin/download/otp_src_R12B-2/erts/start_scripts/start_clean.script
>>  > /home/admin/download/otp_src_R12B-2/erts/start_scripts/start_clean.rel
>> )
>>  > /bin/sh: erlc: command not found
>>  > make[3]: ***
>>  >
>> [/home/admin/download/otp_src_R12B-2/erts/start_scripts/start_clean.script]
>>  > Error 127
>>  > make[3]: Leaving directory
>>  > `/home/admin/download/otp_src_R12B-2/erts/start_scripts'
>>  > make[2]: *** [release] Error 2
>>  > make[2]: Leaving directory
>>  > `/home/admin/download/otp_src_R12B-2/erts/start_scripts'
>>  > make[1]: *** [release] Error 2
>>  > make[1]: Leaving directory `/home/admin/download/otp_src_R12B-2/erts'
>>  > make: *** [install.emulator] Error 2
>>
>> I don't have RHEL4, but otp R12B-3 builds and installs fine on
>> my ppc64 box running YDL6 (similar to FC6 and RHEL5).
>>
>> I suspect either an incorrect ./configure or make command, or some
>> undetected build failure prior to the failure you quoted above.
>> Please show us your entire build log, including your ./configure
>> and make commands. (It's going to be big and may not be suitable
>> for posting to a mailing list. You can just give us a URL to it.)
>>
>> /Mikael
>>
>
>
-------------- next part --------------
An HTML attachment was scrubbed...
URL: <http://erlang.org/pipermail/erlang-bugs/attachments/20080809/2aa70524/attachment.html>


More information about the erlang-bugs mailing list